Показать сообщение отдельно
Старый 10.08.2012, 10:40   #1
Неактивный пользователь
 
Пол:Мужской
Регистрация: 30.11.2007
Сообщений: 4
Репутация: 0
Question Debian 6 + Bigbluebutton

Ставлю BigBlueBattun на сервер debian 6 (squzee) по статье http://how-it.ru/public/root/431-ust...n_squeeze.html при установке
Цитата:
gem install gherkin -v '2.2.9'

вываливает ошибку:
Цитата:
Building native extensions. This could take a while...
ERROR: Error installing gherkin:
ERROR: Failed to build gem native extension.

/usr/bin/ruby1.9.2 extconf.rb
checking for main() in -lc... yes
creating Makefile

make
gcc -I. -I/usr/include/ruby-1.9.2/i686-linux -I/usr/include/ruby-1.9.2/ruby/backward -I/usr/include/ruby-1.9.2 -I. -D_FILE_OFFSET_BITS=64 -fPIC -O3 -ggdb -Wextra -Wno-unused-parameter -Wno-parentheses -Wpointer-arith -Wwrite-strings -Wno-missing-field-initializers -Wno-long-long -O0 -Wall -Werror -o gherkin_lexer_ar.o -c gherkin_lexer_ar.c
/Users/aslakhellesoy/scm/gherkin/tasks/../ragel/i18n/ar.c.rl: In function ‘CLexer_scan’:
/Users/aslakhellesoy/scm/gherkin/tasks/../ragel/i18n/ar.c.rl:199:29: error: the comparison will always evaluate as ‘true’ for the address of ‘raise_lexer_error’ will never be NULL [-Werror=address]
/Users/aslakhellesoy/scm/gherkin/tasks/../ragel/i18n/ar.c.rl:199:29: error: the comparison will always evaluate as ‘true’ for the address of ‘raise_lexer_error’ will never be NULL [-Werror=address]
cc1: all warnings being treated as errors
make: *** [gherkin_lexer_ar.o] Ошибка 1

Gem files will remain installed in /usr/lib/ruby/gems/1.9.2/gems/gherkin-2.2.9 for inspection.
Results logged to /usr/lib/ruby/gems/1.9.2/gems/gherkin-2.2.9/ext/gherkin_lexer_ar/gem_make.out

vuttol вне форума
 
Ответить с цитированием Вверх
 
Время генерации страницы 0.10335 секунды с 9 запросами